Target
Tyrosine-protein kinase JAK3
Ligand
BDBM316836
Substrate
Meas. Tech.
JAK Caliper Enzyme Assay
IC50
0.200±n/a nM
Citation
 Thorarensen, ABrown, MFCasimiro-Garcia, AChe, YCoe, JWFlanagan, MEGilbert, AMHayward, MMLangille, JDMontgomery, JITelliez, JUnwalla, RJTrujillo, JI Pyrrolo[2,3-d]pyrimidinyl, pyrrolo[2,3-b]pyrazinyl and pyrrolo[2,3-d]pyridinyl acrylamides US Patent  US9617258 Publication Date 4/11/2017 
Target
Name:
Tyrosine-protein kinase JAK3
Synonyms:
JAK-3 JAK3_HUMAN Janus kinase 3 (JAK3) L-JAK | Leukocyte janus kinase
Type:
Protein
Mol. Mass.:
125111.08
Organism:
Homo sapiens (Human)
Description:
P52333
Residue:
1124
  
Inhibitor
Name:
BDBM316836
Synonyms:
US11111242, Example 339 | US9617258, Example 339
Type:
Small organic molecule
Emp. Form.:
C18H23N5O3
Mol. Mass.:
357.4069
SMILES:
CC(C)NC(=O)c1c[nH]c2ncc(OC3CCN(CC3)C(=O)C=C)nc12
: