Target
Acetylcholinesterase
Ligand
BDBM10964
Substrate
BDBM8959
Meas. Tech.
Cholinesterase Inhibition Assay
pH
8±n/a
Temperature
310.15±n/a K
IC50
130±17 nM
Citation
 Yu, QSZhu, XHolloway, HWWhittaker, NFBrossi, AGreig, NH Anticholinesterase activity of compounds related to geneserine tautomers. N-Oxides and 1,2-oxazines. J Med Chem 45:3684-91 (2002)  
Target
Name:
Acetylcholinesterase
Synonyms:
ACES_HUMAN Acetylcholinesterase (AChE) | Acetylcholinesterase (human AChE)
Type:
Enzyme
Mol. Mass.:
67792.70
Organism:
Homo sapiens (Human)
Description:
P22303
Residue:
614
  
Inhibitor
Name:
BDBM10964
Synonyms:
(4aS,9aS)-2,4a,9-trimethyl-2H,3H,4H,4aH,9H,9aH-indolo[3,2-e][1,2]oxazin-6-yl N-phenylcarbamate | phenylgeneserine oxazine
Type:
Small organic molecule
Emp. Form.:
C20H23N3O3
Mol. Mass.:
353.4149
SMILES:
[H][C@]12ON(C)CC[C@@]1(C)c1cc(OC(=O)Nc3ccccc3)ccc1N2C
:
Substrate
Name:
BDBM8959
Synonyms:
(2-Mercaptoethyl)trimethylammonium iodide acetate Acetylthiocholine acetylthiocholine chloride | acetylthiocholine iodide
Type:
Small organic molecule
Emp. Form.:
C7H16NOS
Mol. Mass.:
162.272
SMILES:
CC(=O)SCC[N+](C)(C)C
: