Target
Cholinesterase
Ligand
BDBM10972
Substrate
BDBM8978
Meas. Tech.
Cholinesterase Inhibition Assay
IC50
5±n/a nM
Citation
 Yu, QSZhu, XHolloway, HWWhittaker, NFBrossi, AGreig, NH Anticholinesterase activity of compounds related to geneserine tautomers. N-Oxides and 1,2-oxazines. J Med Chem 45:3684-91 (2002)  
Target
Name:
Cholinesterase
Synonyms:
Acylcholine acylhydrolase Butyrylcholine esterase (BChE) Butyrylcholinesterase (BuChE) CHLE_HUMAN Cholinesterases Pseudocholinesterase
Type:
Homotetramer
Mol. Mass.:
68422.27
Organism:
Homo sapiens (Human)
Description:
P06276
Residue:
602
  
Inhibitor
Name:
BDBM10972
Synonyms:
(3aS,8aR)-1,3a,8-trimethyl-1H,2H,3H,3aH,8H,8aH-pyrrolo[2,3-b]indol-5-yl N-heptylcarbamate Eptastigmine | Heptylphysostigmine
Type:
Small organic molecule
Emp. Form.:
C21H33N3O2
Mol. Mass.:
359.5056
SMILES:
[H][C@]12N(C)CC[C@@]1(C)c1cc(OC(=O)NCCCCCCC)ccc1N2C
:
Substrate
Name:
BDBM8978
Synonyms:
(Propylcarbonylthioethyl)trimethylammonium iodide CHEMBL148530 butyrylthiocholine | butyrylthiocholine chloride
Type:
Small organic molecule
Emp. Form.:
C9H20NOS
Mol. Mass.:
190.326
SMILES:
CCCC(=O)SCC[N+](C)(C)C
: