Target
DNA-(apurinic or apyrimidinic site) endonuclease
Ligand
BDBM318447
Substrate
Meas. Tech.
Inhibition Assay
Ki
680±n/a nM
Citation
 Gold, BIXie, XSrinivasan, AWang, L Compounds and methods for inhibition of AP endonuclease-1/redox factor-1 (HAPE1) activity US Patent  US9624235 Publication Date 4/18/2017 
Target
Name:
DNA-(apurinic or apyrimidinic site) endonuclease
Synonyms:
APE APEX APEX1_HUMAN Apurinic-apyrimidinic endonuclease 1 (APE-1) DNA-(apurinic or apyrimidinic site) lyase REF1
Type:
Protein
Mol. Mass.:
35560.12
Organism:
Homo sapiens (Human)
Description:
P27695
Residue:
318
  
Inhibitor
Name:
BDBM318447
Synonyms:
NSC332396 | US9624235, Compound 5
Type:
Small organic molecule
Emp. Form.:
C22H19N5O3
Mol. Mass.:
401.418
SMILES:
Cc1[nH]n(-c2ccccc2)c(=O)c1\C=N\Nc1cc(C)nc2cc3OCOc3cc12
: