Target
DNA-(apurinic or apyrimidinic site) endonuclease
Ligand
BDBM318449
Substrate
Meas. Tech.
Inhibition Assay
Ki
10890±n/a nM
Citation
 Gold, BIXie, XSrinivasan, AWang, L Compounds and methods for inhibition of AP endonuclease-1/redox factor-1 (HAPE1) activity US Patent  US9624235 Publication Date 4/18/2017 
Target
Name:
DNA-(apurinic or apyrimidinic site) endonuclease
Synonyms:
APE APEX APEX1_HUMAN Apurinic-apyrimidinic endonuclease 1 (APE-1) DNA-(apurinic or apyrimidinic site) lyase REF1
Type:
Protein
Mol. Mass.:
35560.12
Organism:
Homo sapiens (Human)
Description:
P27695
Residue:
318
  
Inhibitor
Name:
BDBM318449
Synonyms:
NSC300598 | US9624235, Compound 7
Type:
Small organic molecule
Emp. Form.:
C23H23N5O
Mol. Mass.:
385.4616
SMILES:
C\C(=N/Nc1cc(C)nc2ccc(C)cc12)c1cn(C)n(-c2ccccc2)c1=O
: