Target
N-acylethanolamine-hydrolyzing acid amidase
Ligand
BDBM319793
Substrate
Meas. Tech.
Determining Endocannabinoid Hydrolase Activity
IC50
180±n/a nM
Citation
 Liu, ZQiu, YRen, JLi, YYang, LZhu, C Substituted heterocyclic derivative, preparation method and use thereof US Patent  US10174015 Publication Date 1/8/2019 
Target
Name:
N-acylethanolamine-hydrolyzing acid amidase
Synonyms:
ASAH-like protein Acid ceramidase-like protein N-acylsphingosine amidohydrolase-like NAAA PLT
Type:
Enzyme
Mol. Mass.:
40073.12
Organism:
Homo sapiens (Human)
Description:
Q02083
Residue:
359
  
Inhibitor
Name:
BDBM319793
Synonyms:
US10174015, Compound 6
Type:
Small organic molecule
Emp. Form.:
C15H25NO3
Mol. Mass.:
267.3639
SMILES:
O=C(CCCCCC1CCCCC1)N1CCOC1=O
: