Target
Tyrosine-protein kinase JAK2
Ligand
BDBM292115
Substrate
Ki
<0.1±n/a nM
Citation
 Benjamin, NDabros, MThalladi, VR JAK kinase inhibitor compounds for treatment of respiratory disease US Patent  US10183942 Publication Date 1/22/2019 
Target
Name:
Tyrosine-protein kinase JAK2
Synonyms:
JAK-2 JAK2_HUMAN Janus kinase 2 (JAK2) | Janus kinase 2 (a protein tyrosine kinase)
Type:
Protein
Mol. Mass.:
130684.68
Organism:
Homo sapiens (Human)
Description:
O60674
Residue:
1132
  
Inhibitor
Name:
BDBM292115
Synonyms:
US10100049, Example 12 US10526330, Example 12 US11299492, Example 12 | US11718616, Example 12
Type:
Small organic molecule
Emp. Form.:
C26H30F2N6O
Mol. Mass.:
480.5528
SMILES:
CCc1cc(O)c(F)cc1-c1ccc2c(n[nH]c2c1)-c1nc2CN(CC(F)CN(C)C)CCc2[nH]1
: