Target
Orexin/Hypocretin receptor type 1
Ligand
BDBM143779
Substrate
Meas. Tech.
Human Orexin 1 Receptor Ca2+ Mobilization Assay
Ki
9.00±n/a nM
Citation
 Gelin, CFLebold, TPShireman, BTZiff, JM Substituted 2-azabicycles and their use as orexin receptor modulators US Patent  US10183953 Publication Date 1/22/2019 
Target
Name:
Orexin/Hypocretin receptor type 1
Synonyms:
HCRTR1 OX1R_HUMAN Orexin receptor type 1 (OR 1) Orexin receptor type 1 (OX1) Orexin receptor type 1 (OxR1) | Ox1r
Type:
Protein
Mol. Mass.:
47554.50
Organism:
Homo sapiens (Human)
Description:
O43613
Residue:
425
  
Inhibitor
Name:
BDBM143779
Synonyms:
US10183953, Example 40 US9611277, Example 40 | US9845333, 40
Type:
Small organic molecule
Emp. Form.:
C24H21F3N4O3
Mol. Mass.:
470.4437
SMILES:
COc1cccc(-c2ncccn2)c1C(=O)N1CC2CC(Oc3ccc(cn3)C(F)(F)F)C1C2
: