Target
Dual specificity mitogen-activated protein kinase kinase 1 [K97R]
Ligand
BDBM200417
Substrate
Meas. Tech.
Radioactive Binding Assay
IC50
2.00±n/a nM
Citation
 Bock, MGMoebitz, HPanigrahi, SKPoddutoori, RSamajdar, S Compounds and compositions as inhibitors of MEK US Patent  US9629836 Publication Date 4/25/2017 
Target
Name:
Dual specificity mitogen-activated protein kinase kinase 1 [K97R]
Synonyms:
Dual specificity mitogen-activated protein kinase kinase 1 (MEK1)(K97R) MEK1 MP2K1_HUMAN | PRKMK1
Type:
Mol. Mass.:
43467.04
Organism:
Homo sapiens (Human)
Description:
Biotinylated full length MEK1 with an inactivating K97R ATP binding site mutation.
Residue:
393
  
Inhibitor
Name:
BDBM200417
Synonyms:
US9227969, 44 | US9629836, 44
Type:
Small organic molecule
Emp. Form.:
C30H27ClFN5O4
Mol. Mass.:
576.018
SMILES:
Cc1nc2cnc3cc(F)c(cc3c2n1C1CCN(CC1)C(=O)CO)-c1ccc(Oc2cccc(CO)n2)cc1Cl
: