Target
Glycogen synthase kinase-3 beta
Ligand
BDBM11452
Substrate
GSK-3 Peptide Substrate
Meas. Tech.
GSK-3 beta Inhibition Assay
pH
7.5±n/a
Temperature
295.15±n/a K
IC50
780±n/a nM
Citation
 Richardson, CMWilliamson, DSParratt, MJBorgognoni, JCansfield, ADDokurno, PFrancis, GLHowes, RMoore, JDMurray, JBRobertson, ASurgenor, AETorrance, CJ Triazolo[1,5-a]pyrimidines as novel CDK2 inhibitors: protein structure-guided design and SAR. Bioorg Med Chem Lett 16:1353-7 (2006)  
Target
Name:
Glycogen synthase kinase-3 beta
Synonyms:
GSK-3, beta Glycogen Synthase Kinase-3, beta | Gsk3b
Type:
Enzyme
Mol. Mass.:
46754.43
Organism:
Rattus norvegicus (rat)
Description:
The rat GSK-3 beta cDNA was inserted into the baculovirus vector. The protein was purified from virus-infected sf9 insect cells
Residue:
420
  
Inhibitor
Name:
BDBM11452
Synonyms:
4-({5-[(4-aminocyclohexyl)amino]-[1,2,4]triazolo[1,5-a]pyrimidin-7-yl}amino)benzene-1-sulfonamide | triazolo[1,5-a]pyrimidine 14
Type:
Small organic molecule
Emp. Form.:
C17H22N8O2S
Mol. Mass.:
402.474
SMILES:
N[C@H]1CC[C@@H](CC1)Nc1cc(Nc2ccc(cc2)S(N)(=O)=O)n2ncnc2n1
:
Substrate
Name:
GSK-3 Peptide Substrate
Synonyms:
GS-1 Peptide | Phospho-GS2 Substrate Peptide
Type:
Peptide
Mol. Mass.:
3045.17
Organism:
Description:
Residue:
27