Target
Serine/threonine-protein kinase ATR
Ligand
BDBM323365
Substrate
Meas. Tech.
Inhibition Assay
Ki
<5±n/a nM
Citation
 Charrier, JBinch, HMHurley, DJCleveland, TJoshi, PFanning, LTPinder, JO Donnell, MNizarali Virani, AKnegtel, RMDurrant, SJYoung, SCStorck, PKay, DReaper, PMGrote, MP Compounds useful as inhibitors of ATR kinase US Patent  US9630956 Publication Date 4/25/2017 
Target
Name:
Serine/threonine-protein kinase ATR
Synonyms:
ATR Ataxia telangiectasia and Rad3-related protein (ATR) FRP1 | Serine-protein kinase ATR
Type:
Protein
Mol. Mass.:
301404.58
Organism:
Homo sapiens (Human)
Description:
Q13535
Residue:
2644
  
Inhibitor
Name:
BDBM323365
Synonyms:
US9630956, Compound I-102
Type:
Small organic molecule
Emp. Form.:
C27H29N7O3
Mol. Mass.:
499.5643
SMILES:
CNCc1ccc(cc1)-c1cc(on1)-c1nc(cnc1N)-c1ccc(=O)n(c1)C(C)C(=O)N1CCCC1
: