Target
Serine/threonine-protein kinase ATR
Ligand
BDBM323366
Substrate
Meas. Tech.
Inhibition Assay
Ki
<5±n/a nM
Citation
 Charrier, JBinch, HMHurley, DJCleveland, TJoshi, PFanning, LTPinder, JO Donnell, MNizarali Virani, AKnegtel, RMDurrant, SJYoung, SCStorck, PKay, DReaper, PMGrote, MP Compounds useful as inhibitors of ATR kinase US Patent  US9630956 Publication Date 4/25/2017 
Target
Name:
Serine/threonine-protein kinase ATR
Synonyms:
ATR Ataxia telangiectasia and Rad3-related protein (ATR) FRP1 | Serine-protein kinase ATR
Type:
Protein
Mol. Mass.:
301404.58
Organism:
Homo sapiens (Human)
Description:
Q13535
Residue:
2644
  
Inhibitor
Name:
BDBM323366
Synonyms:
US9630956, Compound I-103
Type:
Small organic molecule
Emp. Form.:
C20H18N6O2
Mol. Mass.:
374.3959
SMILES:
CC(N)c1cccc(c1)-c1cc(on1)-c1nc(cnc1N)-c1ccc(=O)[nH]c1
: