Target
Histone deacetylase 1
Ligand
BDBM323704
Substrate
Meas. Tech.
HDAC Inhibition Assay
IC50
0.200±n/a nM
Citation
 Hooker, JMWang, CSchroeder, FA Imaging histone deacetylases with a radiotracer using positron emission tomography US Patent  US10188756 Publication Date 1/29/2019 
Target
Name:
Histone deacetylase 1
Synonyms:
Cereblon/Histone deacetylase 1 HDAC1 Histone deacetylase 1 (HDAC1) RPD3L1
Type:
Enzyme
Mol. Mass.:
55090.27
Organism:
Homo sapiens (Human)
Description:
Q13547
Residue:
482
  
Inhibitor
Name:
BDBM323704
Synonyms:
US10188756, Compound CN107
Type:
Small organic molecule
Emp. Form.:
C21H23N3O2
Mol. Mass.:
349.4262
SMILES:
Cn1cc(CCNCc2ccc(\C=C\C(=O)NO)cc2)c2ccccc12
: