Target
Histone deacetylase 5
Ligand
BDBM323710
Substrate
Meas. Tech.
HDAC Inhibition Assay
IC50
244±n/a nM
Citation
 Hooker, JMWang, CSchroeder, FA Imaging histone deacetylases with a radiotracer using positron emission tomography US Patent  US10188756 Publication Date 1/29/2019 
Target
Name:
Histone deacetylase 5
Synonyms:
Antigen NY-CO-9 HDAC5 Histone acetylase 5 (HDAC5) Human HDAC5 | KIAA0600
Type:
Enzyme
Mol. Mass.:
121968.61
Organism:
Homo sapiens (Human)
Description:
Q9UQL6
Residue:
1122
  
Inhibitor
Name:
BDBM323710
Synonyms:
US10188756, Compound CN139
Type:
Small organic molecule
Emp. Form.:
C20H26N2O2
Mol. Mass.:
326.4326
SMILES:
ONC(=O)\C=C\c1cccc(CNC23CC4CC(CC(C4)C2)C3)c1
: