Target
Histone deacetylase 1
Ligand
BDBM323718
Substrate
Meas. Tech.
HDAC Inhibition Assay
IC50
0.780±n/a nM
Citation
 Hooker, JMWang, CSchroeder, FA Imaging histone deacetylases with a radiotracer using positron emission tomography US Patent  US10188756 Publication Date 1/29/2019 
Target
Name:
Histone deacetylase 1
Synonyms:
Cereblon/Histone deacetylase 1 HDAC1 Histone deacetylase 1 (HDAC1) RPD3L1
Type:
Enzyme
Mol. Mass.:
55090.27
Organism:
Homo sapiens (Human)
Description:
Q13547
Residue:
482
  
Inhibitor
Name:
BDBM323718
Synonyms:
US10188756, Compound CN149 | US11207431, Example B
Type:
Small organic molecule
Emp. Form.:
C22H29FN2O2
Mol. Mass.:
372.4763
SMILES:
CN(Cc1ccc(\C=C\C(=O)NO)cc1F)CC12CC3CC(CC(C3)C1)C2
: