Target
Tyrosine-protein kinase JAK1
Ligand
BDBM324428
Substrate
Meas. Tech.
JAK Enzyme Assays
Ki
0.200±n/a nM
Citation
 Cheng, YHua, RKellar, TLi, WGibbons, PZak, ME Therapeutic compounds, compositions and methods of use thereof US Patent  US10189836 Publication Date 1/29/2019 
Target
Name:
Tyrosine-protein kinase JAK1
Synonyms:
JAK-1 JAK1A JAK1_HUMAN Janus kinase 1 (JAK1) | Janus kinase 1 JAK1
Type:
Protein
Mol. Mass.:
133293.73
Organism:
Homo sapiens (Human)
Description:
P23458
Residue:
1154
  
Inhibitor
Name:
BDBM324428
Synonyms:
2-[4-[[8-[(1S,5R)-8- benzyloxy-3- azabicyclo[3.2.1]octan- 3-yl]-[1,2,4]triazolo[1,5-a] pyridin-2- yl]amino]pyrazol-1-yl]- 1-(4-methylpiperazin-1- yl)ethanone | US10189836, Example 1
Type:
Small organic molecule
Emp. Form.:
C30H37N9O2
Mol. Mass.:
555.6739
SMILES:
CN1CCN(CC1)C(=O)Cn1cc(Nc2nc3c(cccn3n2)N2C[C@@H]3CC[C@H](C2)[C@@H]3OCc2ccccc2)cn1
: