Target
Tyrosine-protein kinase JAK1
Ligand
BDBM324578
Substrate
Meas. Tech.
JAK Enzyme Assays
Ki
0.200±n/a nM
Citation
 Cheng, YHua, RKellar, TLi, WGibbons, PZak, ME Therapeutic compounds, compositions and methods of use thereof US Patent  US10189836 Publication Date 1/29/2019 
Target
Name:
Tyrosine-protein kinase JAK1
Synonyms:
JAK-1 JAK1A JAK1_HUMAN Janus kinase 1 (JAK1) | Janus kinase 1 JAK1
Type:
Protein
Mol. Mass.:
133293.73
Organism:
Homo sapiens (Human)
Description:
P23458
Residue:
1154
  
Inhibitor
Name:
BDBM324578
Synonyms:
2-[4-[[8-[8-[3-hydroxy-3- (trifluoromethyl)azetidine- 1-carbonyl]-3,8- diazabicyclo[3.2.1]octan- 3-yl]-[1,2,4]triazolo[1,5-a] pyridin-2- yl]amino]pyrazol-1-yl]-1- (4-methylpiperazin-1- yl)ethanone | US10189836, Example 141
Type:
Small organic molecule
Emp. Form.:
C27H34F3N11O3
Mol. Mass.:
617.626
SMILES:
CN1CCN(CC1)C(=O)Cn1cc(Nc2nc3c(cccn3n2)N2CC3CCC(C2)N3C(=O)N2CC(O)(C2)C(F)(F)F)cn1
: