Target
Ubiquitin carboxyl-terminal hydrolase 1
Ligand
BDBM324810
Substrate
Meas. Tech.
Ubitquin-Rhodamine 110 Assay for USP1 Activity
IC50
<0.002±n/a nM
Citation
 Buckmelter, AJIoannidis, SFollows, BGustafson, GWang, MCaravella, JAWang, ZFritzen, ELLin, J Purinones as ubiquitin-specific protease 1 inhibitors US Patent  US10189841 Publication Date 1/29/2019 
Target
Name:
Ubiquitin carboxyl-terminal hydrolase 1
Synonyms:
Deubiquitinating enzyme 1 USP1 Ubiquitin thioesterase 1 hUBP
Type:
PROTEIN
Mol. Mass.:
88191.62
Organism:
Homo sapiens (Human)
Description:
ChEMBL_104169
Residue:
785
  
Inhibitor
Name:
BDBM324810
Synonyms:
9-(4-(2H-1,2,3-triazol-2- US10399980, Compound I-16
Type:
Small organic molecule
Emp. Form.:
C21H16FN7O2
Mol. Mass.:
417.3958
SMILES:
COc1c(F)cccc1-c1ncc2[nH]c(=O)n(Cc3ccc(cc3)-n3nccn3)c2n1
: