Target
Ubiquitin carboxyl-terminal hydrolase 1
Ligand
BDBM325272
Substrate
Meas. Tech.
Ubitquin-Rhodamine 110 Assay for USP1 Activity
IC50
<0.002±n/a nM
Citation
 Buckmelter, AJIoannidis, SFollows, BGustafson, GWang, MCaravella, JAWang, ZFritzen, ELLin, J Purinones as ubiquitin-specific protease 1 inhibitors US Patent  US10189841 Publication Date 1/29/2019 
Target
Name:
Ubiquitin carboxyl-terminal hydrolase 1
Synonyms:
Deubiquitinating enzyme 1 USP1 Ubiquitin thioesterase 1 hUBP
Type:
PROTEIN
Mol. Mass.:
88191.62
Organism:
Homo sapiens (Human)
Description:
ChEMBL_104169
Residue:
785
  
Inhibitor
Name:
BDBM325272
Synonyms:
N-isopropyl-4-((2- US10399980, Compound I-478
Type:
Small organic molecule
Emp. Form.:
C25H34N6O2
Mol. Mass.:
450.5765
SMILES:
CC(C)NC(=O)N1CCC(Cn2c3nc(ncc3n(C)c2=O)-c2ccccc2C(C)C)CC1
: