Target
Histone-lysine N-methyltransferase EZH2
Ligand
BDBM325818
Substrate
Meas. Tech.
Enzyme Assay
IC50
<300±n/a nM
Citation
 Kuntz, KWOlhava, EJChesworth, RDuncan, KW Substituted 6,5-fused bicyclic heteroaryl compounds US Patent  US9637472 Publication Date 5/2/2017 
Target
Name:
Histone-lysine N-methyltransferase EZH2
Synonyms:
ENX-1 EZH2_HUMAN Histone-lysine N-methyltransferase EZH2 Lysine N-methyltransferase 6
Type:
Protein
Mol. Mass.:
85367.84
Organism:
Homo sapiens (Human)
Description:
Q15910
Residue:
746
  
Inhibitor
Name:
BDBM325818
Synonyms:
US10273223, Compound A-14 | US9637472, Compound A-14
Type:
Small organic molecule
Emp. Form.:
C25H28N6O2
Mol. Mass.:
444.5288
SMILES:
CC(C)n1ncc2c(cc(nc12)-c1ccc(CN)cc1)C(=O)NCc1c(C)cc(C)[nH]c1=O
: