Target
Histone-lysine N-methyltransferase EZH2
Ligand
BDBM326119
Substrate
Meas. Tech.
Enzyme Assay
IC50
<300±n/a nM
Citation
 Kuntz, KWOlhava, EJChesworth, RDuncan, KW Substituted 6,5-fused bicyclic heteroaryl compounds US Patent  US9637472 Publication Date 5/2/2017 
Target
Name:
Histone-lysine N-methyltransferase EZH2
Synonyms:
ENX-1 EZH2_HUMAN Histone-lysine N-methyltransferase EZH2 Lysine N-methyltransferase 6
Type:
Protein
Mol. Mass.:
85367.84
Organism:
Homo sapiens (Human)
Description:
Q15910
Residue:
746
  
Inhibitor
Name:
BDBM326119
Synonyms:
US10273223, Compound D-17 | US9637472, Compound D-17
Type:
Small organic molecule
Emp. Form.:
C23H28BrN5O2
Mol. Mass.:
486.405
SMILES:
CN(C)Cc1cc(C)[nH]c(=O)c1CNC(=O)c1cc(Br)cc2n(ncc12)C1CCCC1
: