Target
Histone-lysine N-methyltransferase EZH2
Ligand
BDBM326146
Substrate
Meas. Tech.
Enzyme Assay
IC50
<300±n/a nM
Citation
 Kuntz, KWOlhava, EJChesworth, RDuncan, KW Substituted 6,5-fused bicyclic heteroaryl compounds US Patent  US9637472 Publication Date 5/2/2017 
Target
Name:
Histone-lysine N-methyltransferase EZH2
Synonyms:
ENX-1 EZH2_HUMAN Histone-lysine N-methyltransferase EZH2 Lysine N-methyltransferase 6
Type:
Protein
Mol. Mass.:
85367.84
Organism:
Homo sapiens (Human)
Description:
Q15910
Residue:
746
  
Inhibitor
Name:
BDBM326146
Synonyms:
US10273223, Compound D-44 | US9637472, Compound D-44
Type:
Small organic molecule
Emp. Form.:
C31H40N6O2
Mol. Mass.:
528.6883
SMILES:
Cc1cc(C)c(CNC(=O)c2cc(cc3n(ncc23)C2CCCC2)C2=CCN(CC2)C2CCNCC2)c(=O)[nH]1
: