Target
Orexin/Hypocretin receptor type 1
Ligand
BDBM164145
Substrate
Meas. Tech.
Rat and Human Orexin 1 Receptor Radioligand Binding Assay
Ki
>10000±n/a nM
Citation
 Coate, HRDvorak, CAFitzgerald, AELebold, TPPreville, CShireman, BT Substituted 7-azabicycles and their use as orexin receptor modulators US Patent  US9637496 Publication Date 5/2/2017 
Target
Name:
Orexin/Hypocretin receptor type 1
Synonyms:
Hcrtr1 OX1R_RAT Orexin receptor type 1 (OX1R) Ox1-R | Ox1R
Type:
Protein
Mol. Mass.:
46817.55
Organism:
Rattus norvegicus (Rat)
Description:
P56718
Residue:
416
  
Inhibitor
Name:
BDBM164145
Synonyms:
US9062078, 275 US9637496, 275 | US9695183, 275
Type:
Small organic molecule
Emp. Form.:
C23H21FN6O3
Mol. Mass.:
448.4496
SMILES:
COC(=O)c1cnc(NC2CC3CCC2N3C(=O)c2cccc(F)c2-c2ncccn2)cn1
: