Target
Muscarinic acetylcholine receptor M1
Ligand
BDBM193802
Substrate
Meas. Tech.
Receptor Selection and Amplification Assays
EC50
0.50±n/a nM
Citation
 Burstein, ESEskildsen, JOlsson, R Muscarinic agonists US Patent  US9670209 Publication Date 6/6/2017 
Target
Name:
Muscarinic acetylcholine receptor M1
Synonyms:
ACM1_HUMAN Cholinergic receptor, muscarinic 1 | Cholinergic, muscarinic M1
Type:
Protein
Mol. Mass.:
51442.54
Organism:
Homo sapiens (Human)
Description:
P11229
Residue:
460
  
Inhibitor
Name:
BDBM193802
Synonyms:
US9670209, Compound 312 1-((R)-3-(3-(cyclopropylmethoxy)-8-aza-bicyclo[3.2.1]octan-8-yl)-3-methylpropyl)-6-methyl-1H-indazole
Type:
Small organic molecule
Emp. Form.:
C22H33N3O
Mol. Mass.:
355.5169
SMILES:
COCC[C@@H]1C[C@@H]2CC[C@H](C1)N2C[C@@H](C)Cn1ncc2ccc(C)cc12
: