Target
Muscarinic acetylcholine receptor M1
Ligand
BDBM193823
Substrate
Meas. Tech.
Receptor Selection and Amplification Assays
EC50
0.79±n/a nM
Citation
 Burstein, ESEskildsen, JOlsson, R Muscarinic agonists US Patent  US9670209 Publication Date 6/6/2017 
Target
Name:
Muscarinic acetylcholine receptor M1
Synonyms:
ACM1_HUMAN Cholinergic receptor, muscarinic 1 | Cholinergic, muscarinic M1
Type:
Protein
Mol. Mass.:
51442.54
Organism:
Homo sapiens (Human)
Description:
P11229
Residue:
460
  
Inhibitor
Name:
BDBM193823
Synonyms:
US9670209, Compound 323 1-((R)-3-((1R,3R,5S)-3-(2-ethoxyethyl)-8-azabicyclo[3.2.1]octan-8-yl)-2-methylpropyl)-1H-indazole
Type:
Small organic molecule
Emp. Form.:
C22H33N3O
Mol. Mass.:
355.5169
SMILES:
CCOCC[C@@H]1C[C@@H]2CC[C@H](C1)N2C[C@@H](C)Cn1ncc2ccccc12
: