Target
Muscarinic acetylcholine receptor M1
Ligand
BDBM193834
Substrate
Meas. Tech.
Receptor Selection and Amplification Assays
EC50
1.00±n/a nM
Citation
 Burstein, ESEskildsen, JOlsson, R Muscarinic agonists US Patent  US9670209 Publication Date 6/6/2017 
Target
Name:
Muscarinic acetylcholine receptor M1
Synonyms:
ACM1_HUMAN Cholinergic receptor, muscarinic 1 | Cholinergic, muscarinic M1
Type:
Protein
Mol. Mass.:
51442.54
Organism:
Homo sapiens (Human)
Description:
P11229
Residue:
460
  
Inhibitor
Name:
BDBM193834
Synonyms:
US9670209, Comparative compound 2
Type:
Small organic molecule
Emp. Form.:
C12H21NO3
Mol. Mass.:
227.3
SMILES:
CC(C)(C)OC(=O)N1C2CC[C@H]1C[C@@H](O)C2
: