Target
cAMP-specific 3',5'-cyclic phosphodiesterase 4A
Ligand
BDBM150196
Substrate
Meas. Tech.
PDE4 Assay
IC50
6.00±n/a nM
Citation
 Nielsen, SF Benzodioxole or benzodioxepine heterocyclic compounds as phosphodiesterase inhibitors US Patent  US9637499 Publication Date 5/2/2017 
Target
Name:
cAMP-specific 3',5'-cyclic phosphodiesterase 4A
Synonyms:
3',5'-cyclic phosphodiesterase PDE46 PDE4A_HUMAN Phosphodiesterase 4A | Phosphodiesterase 4A (PDE4)
Type:
Enzyme
Mol. Mass.:
98113.27
Organism:
Homo sapiens (Human)
Description:
P27815
Residue:
886
  
Inhibitor
Name:
BDBM150196
Synonyms:
US8980905, 103 | US9637499, Compound 103
Type:
Small organic molecule
Emp. Form.:
C21H19Cl2F2NO5
Mol. Mass.:
474.282
SMILES:
FC(F)Oc1ccc(C(=O)Cc2c(Cl)cncc2Cl)c2OCC3(CCOCC3)COc12
: