Target
Carboxypeptidase B2
Ligand
BDBM326397
Substrate
Meas. Tech.
Enzyme Inhibitory Assay
IC50
7.90±n/a nM
Citation
 Nagata, TKobayashi, JOnishi, YKishida, MNoguchi, K Cyclopropanecarboxylic acid derivative US Patent  US9662310 Publication Date 5/30/2017 
Target
Name:
Carboxypeptidase B2
Synonyms:
CBPB2_HUMAN CPU Carboxypeptidase B2 isoform A Plasma carboxypeptidase B Thrombin-activable fibrinolysis inhibitor | pCPB
Type:
Enzyme
Mol. Mass.:
48432.74
Organism:
Homo sapiens (Human)
Description:
Q96IY4
Residue:
423
  
Inhibitor
Name:
BDBM326397
Synonyms:
(1R,2S)-2-[(2R)-2-(Aminomethyl)butyl]-1-(1-phenyl-1H-imidazol-4-yl)cyclopropanecarboxylic acid | US9662310, Example 62
Type:
Small organic molecule
Emp. Form.:
C24H33N3O4
Mol. Mass.:
427.5365
SMILES:
CC[C@@H](CNC(=O)OC(C)(C)C)C[C@H]1C[C@]1(C(=O)OC)c1cn(cn1)-c1ccccc1
: