Target
Ribosomal protein S6 kinase beta-1
Ligand
BDBM224551
Substrate
Meas. Tech.
Enzyme Assay
IC50
560±n/a nM
Citation
 Lan, RHuck, BRChen, XDeselm, LCQiu, HXiao, YNeagu, CMochalkin, IJohnson, TL Aminopyrimidine derivatives for use as modulators of kinase activity US Patent  US9662330 Publication Date 5/30/2017 
Target
Name:
Ribosomal protein S6 kinase beta-1
Synonyms:
70 kDa ribosomal protein S6 kinase 1 70 kDa ribosomal protein kinase (p70S6K) Protein kinase 70S6K (T412E) RPS6KB1 Ribosomal protein S6 kinase I STK14A p70S6K1
Type:
Enzyme
Mol. Mass.:
59139.89
Organism:
Homo sapiens (Human)
Description:
His-tagged S6K1.
Residue:
525
  
Inhibitor
Name:
BDBM224551
Synonyms:
US10080750, Compound 234 US9662330, Compound 234
Type:
Small organic molecule
Emp. Form.:
C19H24Cl2N6O2
Mol. Mass.:
439.339
SMILES:
COC[C@H](NC(=O)C1(N)CCN(CC1)c1ncnc(N)c1Cl)c1ccc(Cl)cc1
: