Target
Leukotriene A-4 hydrolase
Ligand
BDBM326921
Substrate
Meas. Tech.
Enzyme Assay
IC50
0.042±n/a nM
Citation
 Bylock, LA Benzodioxane inhibitors of leukotriene production for combination therapy US Patent  US9662339 Publication Date 5/30/2017 
Target
Name:
Leukotriene A-4 hydrolase
Synonyms:
LKHA4_HUMAN LTA4 Leukotriene A(4) hydrolase Leukotriene A4 hydrolase
Type:
Hydrolase; metalloprotease
Mol. Mass.:
69280.41
Organism:
Homo sapiens (Human)
Description:
Human recombinant LTA4H.
Residue:
611
  
Inhibitor
Name:
BDBM326921
Synonyms:
4-(1-{4-[(2S)-2,3-dihydro-1,4- benzodioxin-2- yl]benzyl}piperidin-4-yl)butanoic acid | US9662339, 181
Type:
Small organic molecule
Emp. Form.:
C24H29NO4
Mol. Mass.:
395.4914
SMILES:
OC(=O)CCCC1CCN(Cc2ccc(cc2)[C@H]2COc3ccccc3O2)CC1
: