Target
Leukotriene A-4 hydrolase
Ligand
BDBM326944
Substrate
Meas. Tech.
Enzyme Assay
IC50
0.120±n/a nM
Citation
 Bylock, LA Benzodioxane inhibitors of leukotriene production for combination therapy US Patent  US9662339 Publication Date 5/30/2017 
Target
Name:
Leukotriene A-4 hydrolase
Synonyms:
LKHA4_HUMAN LTA4 Leukotriene A(4) hydrolase Leukotriene A4 hydrolase
Type:
Hydrolase; metalloprotease
Mol. Mass.:
69280.41
Organism:
Homo sapiens (Human)
Description:
Human recombinant LTA4H.
Residue:
611
  
Inhibitor
Name:
BDBM326944
Synonyms:
7-{4-[(3S)-2,3- dihydro[1,4]dioxino[2,3- b]pyridin-3-yl]benzyl}-1,7- diazaspiro[4.4]nonan-2-one | US9662339, 127
Type:
Small organic molecule
Emp. Form.:
C21H23N3O3
Mol. Mass.:
365.4256
SMILES:
O=C1CCC2(CCN(Cc3ccc(cc3)[C@H]3COc4cccnc4O3)C2)N1
: