Target
Leukotriene A-4 hydrolase
Ligand
BDBM326973
Substrate
Meas. Tech.
Enzyme Assay
IC50
0.150±n/a nM
Citation
 Bylock, LA Benzodioxane inhibitors of leukotriene production for combination therapy US Patent  US9662339 Publication Date 5/30/2017 
Target
Name:
Leukotriene A-4 hydrolase
Synonyms:
LKHA4_HUMAN LTA4 Leukotriene A(4) hydrolase Leukotriene A4 hydrolase
Type:
Hydrolase; metalloprotease
Mol. Mass.:
69280.41
Organism:
Homo sapiens (Human)
Description:
Human recombinant LTA4H.
Residue:
611
  
Inhibitor
Name:
BDBM326973
Synonyms:
8-{4-[(2S)-2,3-dihydro-1,4- benzodioxin-2-yl]benzyl}-2,8- diazaspiro[4.5]decan-1-one | US9662339, 194
Type:
Small organic molecule
Emp. Form.:
C23H26N2O3
Mol. Mass.:
378.4641
SMILES:
O=C1NCCC11CCN(Cc2ccc(cc2)[C@H]2COc3ccccc3O2)CC1
: