Target
Leukotriene A-4 hydrolase
Ligand
BDBM327061
Substrate
Meas. Tech.
Enzyme Assay
IC50
0.130±n/a nM
Citation
 Bylock, LA Benzodioxane inhibitors of leukotriene production for combination therapy US Patent  US9662339 Publication Date 5/30/2017 
Target
Name:
Leukotriene A-4 hydrolase
Synonyms:
LKHA4_HUMAN LTA4 Leukotriene A(4) hydrolase Leukotriene A4 hydrolase
Type:
Hydrolase; metalloprotease
Mol. Mass.:
69280.41
Organism:
Homo sapiens (Human)
Description:
Human recombinant LTA4H.
Residue:
611
  
Inhibitor
Name:
BDBM327061
Synonyms:
1-{4-[(2S)-2,3-dihydro-1,4- benzodioxin-2-yl]benzyl}-4-(1H- tetrazol-5-yl)piperidine | US9662339, 216
Type:
Small organic molecule
Emp. Form.:
C21H23N5O2
Mol. Mass.:
377.4396
SMILES:
C(N1CCC(CC1)c1nnn[nH]1)c1ccc(cc1)[C@H]1COc2ccccc2O1
: