Target
Receptor-type tyrosine-protein kinase FLT3
Ligand
BDBM31096
Substrate
Meas. Tech.
EGFR kinase assay
Temperature
298.15±n/a K
IC50
0.28±n/a nM
Comments
extracted
Citation
 Li, HXu, YZhao, ZLiu, XZhou, WBai, FXue, MZhang, LZhang, Y Pteridine ketone derivative and applications thereof as EGFR, BLK, and FLT3 inhibitor US Patent  US9670213 Publication Date 6/6/2017 
Target
Name:
Receptor-type tyrosine-protein kinase FLT3
Synonyms:
CD135 FL cytokine receptor FLK2 FLT3 Fetal liver kinase-2 Fms-like tyrosine kinase 3 (Flt-3) STK-1 Stem cell tyrosine kinase 1
Type:
Enzyme
Mol. Mass.:
112888.62
Organism:
Homo sapiens (Human)
Description:
P36888
Residue:
993
  
Inhibitor
Name:
BDBM31096
Synonyms:
CHEMBL290084 cid_451705
Type:
Small organic molecule
Emp. Form.:
C28H26N4O3
Mol. Mass.:
466.531
SMILES:
CN[C@H]1C[C@@H]2O[C@](C)([C@H]1OC)n1c3ccccc3c3c4CNC(=O)c4c4c5ccccc5n2c4c13
: