Target
Epidermal growth factor receptor [T790M,L858R]
Ligand
BDBM195887
Substrate
Meas. Tech.
EGFR kinase assay
Temperature
298.15±n/a K
IC50
1.17±n/a nM
Comments
extracted
Citation
 Li, HXu, YZhao, ZLiu, XZhou, WBai, FXue, MZhang, LZhang, Y Pteridine ketone derivative and applications thereof as EGFR, BLK, and FLT3 inhibitor US Patent  US9670213 Publication Date 6/6/2017 
Target
Name:
Epidermal growth factor receptor [T790M,L858R]
Synonyms:
EGFR EGFR_HUMAN ERBB1 Epidermal growth factor receptor (EGFR)(T790M/L858R) Epidermal growth factor receptor (T790M, L858R) Epidermal growth factor receptor(L858R, T790M) | HER1
Type:
Mol. Mass.:
134353.72
Organism:
Homo sapiens (Human)
Description:
P00533[T790M,L858R]
Residue:
1210
  
Inhibitor
Name:
BDBM195887
Synonyms:
US9670213, Compound 032 N-(3-(2-(2-methoxy-4-(4-methyl-1-piperazinyl)-phenylamino)-7-oxo-8(7H)-pteridin-yl)phenyl)acrylamide
Type:
Small organic molecule
Emp. Form.:
C27H28N8O3
Mol. Mass.:
512.563
SMILES:
COc1cc(ccc1Nc1ncc2ncc(=O)n(-c3cccc(NC(=O)C=C)c3)c2n1)N1CCN(C)CC1
: