Target
Non-specific protein-tyrosine kinase
Ligand
BDBM196248
Substrate
Meas. Tech.
Kinase Assay
pH
7.5±n/a
IC50
246±n/a nM
Comments
extracted
Citation
 Gray, NSZhang, JOkram, BDeng, X Small molecule myristate inhibitors of Bcr-abl and methods of use US Patent  US9670214 Publication Date 6/6/2017 
Target
Name:
Non-specific protein-tyrosine kinase
Synonyms:
BCR/ABL fusion protein isoform X3
Type:
Protein
Mol. Mass.:
178596.49
Organism:
Homo sapiens (Human)
Description:
A9UEZ6
Residue:
1633
  
Inhibitor
Name:
BDBM196248
Synonyms:
US9670214, TABLE 10.46
Type:
Small organic molecule
Emp. Form.:
C17H11F3N6O
Mol. Mass.:
372.304
SMILES:
FC(F)(F)Oc1ccc(Nc2ncnc3n(ncc23)-c2ccccn2)cc1
: