Target
Non-specific protein-tyrosine kinase
Ligand
BDBM50328194
Substrate
Meas. Tech.
Kinase Assay
pH
7.5±n/a
IC50
380±n/a nM
Comments
extracted
Citation
 Gray, NSZhang, JOkram, BDeng, X Small molecule myristate inhibitors of Bcr-abl and methods of use US Patent  US9670214 Publication Date 6/6/2017 
Target
Name:
Non-specific protein-tyrosine kinase
Synonyms:
BCR/ABL fusion protein isoform X3
Type:
Protein
Mol. Mass.:
178596.49
Organism:
Homo sapiens (Human)
Description:
A9UEZ6
Residue:
1633
  
Inhibitor
Name:
BDBM50328194
Synonyms:
7-(2-morpholinoethyl)-N-(4-(trifluoromethoxy)phenyl)-7H-pyrrolo[2,3-d]pyrimidin-4-amine US9670214, TABLE 12.5
Type:
Small organic molecule
Emp. Form.:
C19H20F3N5O2
Mol. Mass.:
407.3896
SMILES:
FC(F)(F)Oc1ccc(Nc2ncnc3n(CCN4CCOCC4)ccc23)cc1
: