Target
Non-specific protein-tyrosine kinase [T818I]
Ligand
BDBM50328188
Substrate
Meas. Tech.
Kinase Assay
pH
7.5±n/a
IC50
2300±n/a nM
Comments
extracted
Citation
 Gray, NSZhang, JOkram, BDeng, X Small molecule myristate inhibitors of Bcr-abl and methods of use US Patent  US9670214 Publication Date 6/6/2017 
Target
Name:
Non-specific protein-tyrosine kinase [T818I]
Synonyms:
A9UEZ6_HUMAN BCR/ABL fusion protein (T351I)
Type:
Protein
Mol. Mass.:
178608.54
Organism:
Homo sapiens (Human)
Description:
A9UEZ6[T818I]
Residue:
1633
  
Inhibitor
Name:
BDBM50328188
Synonyms:
CHEMBL1257540 piperazin-1-yl(4-(4-(trifluoromethoxy)phenylamino)thieno[2,3-d]pyrimidin-6-yl)methanone
Type:
Small organic molecule
Emp. Form.:
C18H16F3N5O2S
Mol. Mass.:
423.412
SMILES:
FC(F)(F)Oc1ccc(Nc2ncnc3sc(cc23)C(=O)N2CCNCC2)cc1
: