Target
Non-specific protein-tyrosine kinase
Ligand
BDBM50328138
Substrate
Meas. Tech.
Kinase Assay
pH
7.5±n/a
IC50
48±n/a nM
Comments
extracted
Citation
 Gray, NSZhang, JOkram, BDeng, X Small molecule myristate inhibitors of Bcr-abl and methods of use US Patent  US9670214 Publication Date 6/6/2017 
Target
Name:
Non-specific protein-tyrosine kinase
Synonyms:
BCR/ABL fusion protein isoform X3
Type:
Protein
Mol. Mass.:
178596.49
Organism:
Homo sapiens (Human)
Description:
A9UEZ6
Residue:
1633
  
Inhibitor
Name:
BDBM50328138
Synonyms:
(4-methylpiperazin-1-yl)(4-(4-(trifluoromethoxy)phenylamino)thieno[2,3-d]pyrimidin-6-yl)methanone US9670214, TABLE 13.15
Type:
Small organic molecule
Emp. Form.:
C19H18F3N5O2S
Mol. Mass.:
437.439
SMILES:
CN1CCN(CC1)C(=O)c1cc2c(Nc3ccc(OC(F)(F)F)cc3)ncnc2s1
: