Target
Non-specific protein-tyrosine kinase
Ligand
BDBM196551
Substrate
Meas. Tech.
Kinase Assay
pH
7.5±n/a
IC50
>10000±n/a nM
Comments
extracted
Citation
 Gray, NSZhang, JOkram, BDeng, X Small molecule myristate inhibitors of Bcr-abl and methods of use US Patent  US9670214 Publication Date 6/6/2017 
Target
Name:
Non-specific protein-tyrosine kinase
Synonyms:
BCR/ABL fusion protein isoform X3
Type:
Protein
Mol. Mass.:
178596.49
Organism:
Homo sapiens (Human)
Description:
A9UEZ6
Residue:
1633
  
Inhibitor
Name:
BDBM196551
Synonyms:
US9670214, TABLE 15.2
Type:
Small organic molecule
Emp. Form.:
C14H11F3N4O2
Mol. Mass.:
324.2579
SMILES:
CN1C(=O)Cc2c1ncnc2Nc1ccc(OC(F)(F)F)cc1
: