Target
Lethal factor
Ligand
BDBM8580
Substrate
MAPKKide
Meas. Tech.
Fluorescence Resonance Energy Transfer Assay (FRET)
pH
7.4±n/a
Temperature
295.15±n/a K
Ki
42900±6300 nM
Citation
 Jiao, GSSimo, ONagata, MO'Malley, SHemscheidt, TCregar, LMillis, SZGoldman, METang, C Selectively guanidinylated derivatives of neamine. Syntheses and inhibition of anthrax lethal factor protease. Bioorg Med Chem Lett 16:5183-9 (2006)  
Target
Name:
Lethal factor
Synonyms:
Anthrax Lethal Factor (LF) Antrax lethal toxin lef | lethal factor
Type:
PROTEIN
Mol. Mass.:
93758.56
Organism:
Bacillus anthracis
Description:
ChEMBL_1460338
Residue:
809
  
Inhibitor
Name:
BDBM8580
Synonyms:
(2R,3S,4R,5R,6R)-5-amino-2-(aminomethyl)-6-{[(1R,2R,3S,4R,6S)-4,6-diamino-2,3-dihydroxycyclohexyl]oxy}oxane-3,4-diol | Neamine
Type:
Small organic molecule
Emp. Form.:
C12H26N4O6
Mol. Mass.:
322.358
SMILES:
NC[C@H]1O[C@H](O[C@@H]2[C@@H](N)C[C@@H](N)[C@H](O)[C@H]2O)[C@H](N)[C@@H](O)[C@@H]1O
:
Substrate
Name:
MAPKKide
Synonyms:
Type:
Peptide
Mol. Mass.:
358.43
Organism:
Description:
MAPPKKide is a quenched fluoresent substrate peptide based on fluorescence resonance energy transfer (FRET). The C-terminally linked fluorophore of MAPKKide is a FITC, and the acceptor chromophore is 4-([4-(dimethylamino)-phenyl] azo) benzoic acid (DABCYL) (List Biological Laboratories, Inc, Campbell, CA).
Residue:
3
NA