Target
Sigma intracellular receptor 2
Ligand
BDBM312206
Substrate
Meas. Tech.
Receptor Assay
Ki
2.15±0.09 nM
Citation
 McCurdy, CRMesangeau, CChin, FTJames, MLShen, BGambhir, SBiswal, SBehera, D Highly selective sigma receptor ligands and radioligands as probes in nociceptive processing and the pathphysiological study of memory deficits and cognitive disorders US Patent  US9724435 Publication Date 8/8/2017 
Target
Name:
Sigma intracellular receptor 2
Synonyms:
S2r Sigma intracellular receptor 2 Sigma2 receptor Transmembrane protein 97
Type:
Protein
Mol. Mass.:
20953.88
Organism:
Rattus norvegicus (Rat)
Description:
Q5U3Y7
Residue:
176
  
Inhibitor
Name:
BDBM312206
Synonyms:
US9604926, Compound CM-600 | US9724435, Compound CM600
Type:
Small organic molecule
Emp. Form.:
C24H28FN3O3
Mol. Mass.:
425.4958
SMILES:
CC(CCCn1c2ccc(cc2oc1=O)C(C)=O)N1CCN(CC1)c1ccc(F)cc1
: