Target
Sigma intracellular receptor 2
Ligand
BDBM312231
Substrate
Meas. Tech.
Receptor Assay
Ki
0.990±0.178 nM
Citation
 McCurdy, CRMesangeau, CChin, FTJames, MLShen, BGambhir, SBiswal, SBehera, D Highly selective sigma receptor ligands and radioligands as probes in nociceptive processing and the pathphysiological study of memory deficits and cognitive disorders US Patent  US9724435 Publication Date 8/8/2017 
Target
Name:
Sigma intracellular receptor 2
Synonyms:
S2r Sigma intracellular receptor 2 Sigma2 receptor Transmembrane protein 97
Type:
Protein
Mol. Mass.:
20953.88
Organism:
Rattus norvegicus (Rat)
Description:
Q5U3Y7
Residue:
176
  
Inhibitor
Name:
BDBM312231
Synonyms:
US9604926, Compound AZ-59 | US9724435, Compound AZ-59
Type:
Small organic molecule
Emp. Form.:
C22H33N3S2
Mol. Mass.:
403.648
SMILES:
CC(CCCn1c2ccccc2sc1=S)N1CCN(CC1)C1CCCCC1
: