Target
Cyclin-dependent kinase 2/G1/S-specific cyclin-E1
Ligand
BDBM12097
Substrate
Histone H1
Meas. Tech.
Kinase SPA Assay
pH
7.4±n/a
Temperature
295.15±n/a K
IC50
91±n/a nM
Citation
 Pevarello, PFancelli, DVulpetti, AAmici, RVilla, MPittala, VVianello, PCameron, ACiomei, MMercurio, CBischoff, JRRoletto, FVarasi, MBrasca, MG 3-Amino-1,4,5,6-tetrahydropyrrolo[3,4-c]pyrazoles: a new class of CDK2 inhibitors. Bioorg Med Chem Lett 16:1084-90 (2006)  
Target
Name:
Cyclin-dependent kinase 2/G1/S-specific cyclin-E1
Synonyms:
CDK2/CycE CDK2/E Cyclin-Dependent Kinase 2 (CDK2) Cyclin-dependent kinase 2/cyclin E1
Type:
Protein
Mol. Mass.:
Description:
Components:
This complex has 2 components.
Component 1
Name:
Cyclin-dependent kinase 2
Synonyms:
CDK2 CDK2_HUMAN Cell division protein kinase 2 Protein cereblon/Cyclin-dependent kinase 2 | p33 protein kinase
Type:
Enzyme Subunit
Mol. Mass.:
33938.17
Organism:
Homo sapiens (Human)
Description:
P24941
Residue:
298
  
Component 2
Name:
G1/S-specific cyclin-E1
Synonyms:
CCNE CCNE1_HUMAN
Type:
Enzyme Subunit
Mol. Mass.:
47073.17
Organism:
Homo sapiens (Human)
Description:
Residue:
410
  
Inhibitor
Name:
BDBM12097
Synonyms:
3-Amino-1,4,5,6-tetrahydropyrrolo[3,4-c]pyrazole 15 | N-butyl-3-{2-[4-(pyrrolidin-1-yl)phenyl]acetamido}-1H,4H,5H,6H-pyrrolo[3,4-c]pyrazole-5-carboxamide
Type:
Small organic molecule
Emp. Form.:
C22H30N6O2
Mol. Mass.:
410.5126
SMILES:
CCCCNC(=O)N1Cc2n[nH]c(NC(=O)Cc3ccc(cc3)N3CCCC3)c2C1
:
Substrate
Name:
Histone H1
Synonyms:
Type:
Other Protein Type
Mol. Mass.:
358.43
Organism:
Bos taurus (bovine)
Description:
Residue:
3
NA