Target
Aurora kinase A
Ligand
BDBM12085
Substrate
CHOCKtide
Meas. Tech.
Kinase SPA Assay
IC50
>10000±n/a nM
Citation
 Pevarello, PFancelli, DVulpetti, AAmici, RVilla, MPittala, VVianello, PCameron, ACiomei, MMercurio, CBischoff, JRRoletto, FVarasi, MBrasca, MG 3-Amino-1,4,5,6-tetrahydropyrrolo[3,4-c]pyrazoles: a new class of CDK2 inhibitors. Bioorg Med Chem Lett 16:1084-90 (2006)  
Target
Name:
Aurora kinase A
Synonyms:
AIK ARK1 AURKA AYK1 Aurora kinase A (AURA) Aurora kinase A (Aurora A) Aurora-related kinase 1 BTAK Breast-tumor-amplified kinase STK15 Serine/threonine kinase 15 Serine/threonine-protein kinase aurora A hARK1
Type:
Serine/threonine-protein kinase
Mol. Mass.:
45830.98
Organism:
Homo sapiens (Human)
Description:
O14965
Residue:
403
  
Inhibitor
Name:
BDBM12085
Synonyms:
3-Amino-1,4,5,6-tetrahydropyrrolo[3,4-c]pyrazole 3 | N-{5-acetyl-1H,4H,5H,6H-pyrrolo[3,4-c]pyrazol-3-yl}-4-fluorobenzamide
Type:
Small organic molecule
Emp. Form.:
C14H13FN4O2
Mol. Mass.:
288.277
SMILES:
CC(=O)N1Cc2n[nH]c(NC(=O)c3ccc(F)cc3)c2C1
:
Substrate
Name:
CHOCKtide
Synonyms:
Type:
Peptide
Mol. Mass.:
889.06
Organism:
Description:
Residue:
7
LRRWSLG