Target
Vasopressin V1b receptor
Ligand
BDBM260329
Substrate
Meas. Tech.
Binding Test for V1b Receptor
pH
7.4±n/a
Temperature
298.15±n/a K
IC50
1.50±n/a nM
Comments
extracted
Citation
 Yoshinaga, MKuwada, TMiyakoshi, NIshizaka, TWakasugi, DShirokawa, SHattori, NShimazaki, Y Azole derivative US Patent  US9522914 Publication Date 12/20/2016 
Target
Name:
Vasopressin V1b receptor
Synonyms:
AVPR V1b AVPR1B Antidiuretic hormone receptor 1b V1bR VPR3 Vasopressin V1b receptor (V1b) Vasopressin V3 receptor
Type:
Enzyme
Mol. Mass.:
46985.01
Organism:
Homo sapiens (Human)
Description:
P47901
Residue:
424
  
Inhibitor
Name:
BDBM260329
Synonyms:
US9522914, D-18
Type:
Small organic molecule
Emp. Form.:
C28H34ClN5O3
Mol. Mass.:
524.054
SMILES:
CC(C)NC(=O)Cc1nn(-c2ccc(CC(C)N3C4CCC3COC4)cc2)c(=O)n1-c1cccc(Cl)c1
: