Target
Dimer of Gag-Pol polyprotein [489-587]
Ligand
BDBM12212
Substrate
Fluorogenic Peptide Substrate
Meas. Tech.
Enzyme Inhibition Assay
pH
4.5±n/a
Temperature
303.15±n/a K
IC50
45±n/a nM
Citation
 Yeung, CMKlein, LLFlentge, CARandolph, JTZhao, CSun, MDekhtyar, TStoll, VSKempf, DJ Oximinoarylsulfonamides as potent HIV protease inhibitors. Bioorg Med Chem Lett 15:2275-8 (2005)  
Target
Name:
Dimer of Gag-Pol polyprotein [489-587]
Synonyms:
HIV-1 Protease
Type:
Protein Complex
Mol. Mass.:
Description:
Components:
This complex has 2 components.
Component 1
Name:
Gag-Pol polyprotein [489-587]
Synonyms:
HIV protease HIV-1 Protease chain A POL_HV1N5 | gag-pol
Type:
Enzyme Subunit
Mol. Mass.:
10822.21
Organism:
Human immunodeficiency virus type 1
Description:
P12497[489-587]
Residue:
99
  
Component 2
Name:
Gag-Pol polyprotein [489-587]
Synonyms:
HIV protease HIV-1 Protease chain A POL_HV1N5 | gag-pol
Type:
Enzyme Subunit
Mol. Mass.:
10822.21
Organism:
Human immunodeficiency virus type 1
Description:
P12497[489-587]
Residue:
99
  
Inhibitor
Name:
BDBM12212
Synonyms:
(2S)-N-[(2S,3R)-3-hydroxy-4-{[3-(hydroxymethyl)benzene](2-methylpropyl)sulfonamido}-1-phenylbutan-2-yl]-3-methyl-2-{3-[(2-methyl-1,3-thiazol-4-yl)methyl]-2-oxoimidazolidin-1-yl}butanamide | benzenesulfonamide analog 22
Type:
Small organic molecule
Emp. Form.:
C34H47N5O6S2
Mol. Mass.:
685.897
SMILES:
CC(C)CN(C[C@@H](O)[C@H](Cc1ccccc1)NC(=O)[C@H](C(C)C)N1CCN(Cc2csc(C)n2)C1=O)S(=O)(=O)c1cccc(CO)c1
:
Substrate
Name:
Fluorogenic Peptide Substrate
Synonyms:
Type:
Peptide
Mol. Mass.:
4156.59
Organism:
Description:
Residue:
39