Target
Aurora kinase A
Ligand
BDBM12411
Substrate
Biotinylated Peptide Substrate
Meas. Tech.
Recombinant Aurora A Enzyme Assay
pH
7.5±n/a
Temperature
295.15±n/a K
IC50
3900±n/a nM
Citation
 Heron, NMAnderson, MBlowers, DPBreed, JEden, JMGreen, SHill, GBJohnson, TJung, FHMcMiken, HHPannifer, ADPauptit, RAPink, JRoberts, NJ SAR and inhibitor complex structure determination of a novel class of potent and specific Aurora kinase inhibitors. Bioorg Med Chem Lett 16:1320-23 (2006)  
Target
Name:
Aurora kinase A
Synonyms:
AIK ARK1 AURKA AYK1 Aurora kinase A (AURA) Aurora kinase A (Aurora A) Aurora-related kinase 1 BTAK Breast-tumor-amplified kinase STK15 Serine/threonine kinase 15 Serine/threonine-protein kinase aurora A hARK1
Type:
Serine/threonine-protein kinase
Mol. Mass.:
45830.98
Organism:
Homo sapiens (Human)
Description:
O14965
Residue:
403
  
Inhibitor
Name:
BDBM12411
Synonyms:
4-(dipropylsulfamoyl)-N-[5-({6-methoxy-7-[3-(morpholin-4-yl)propoxy]quinazolin-4-yl}amino)pyrimidin-2-yl]benzamide | quinazoline deriv. 9
Type:
Small organic molecule
Emp. Form.:
C33H42N8O6S
Mol. Mass.:
678.802
SMILES:
CCCN(CCC)S(=O)(=O)c1ccc(cc1)C(=O)Nc1ncc(Nc2ncnc3cc(OCCCN4CCOCC4)c(OC)cc23)cn1
:
Substrate
Name:
Biotinylated Peptide Substrate
Synonyms:
Type:
Peptide
Mol. Mass.:
1889.16
Organism:
Description:
Residue:
16
ITINTETRALRRWSLG