Target
Dipeptidyl peptidase 4
Ligand
BDBM12463
Substrate
BDBM11526
Meas. Tech.
DPP Inhibition Measurements
IC50
15000±n/a nM
Citation
 Van der Veken, PSenten, KKertesz, IDe Meester, ILambeir, AMMaes, MBScharpe, SHaemers, AAugustyns, K Fluoro-olefins as peptidomimetic inhibitors of dipeptidyl peptidases. J Med Chem 48:1768-80 (2005)  
Target
Name:
Dipeptidyl peptidase 4
Synonyms:
ADABP Adenosine deaminase complexing protein 2 CD_antigen=CD26 DPP4 DPPIV Dipeptidyl peptidase 4 (DPP IV) Dipeptidyl peptidase 4 (DPP4) Dipeptidyl peptidase 4 membrane form Dipeptidyl peptidase IV Dipeptidyl peptidase IV (DDP-IV) Dipeptidyl peptidase IV membrane form Dipeptidyl peptidase-IV (DPP-4) T-cell activation antigen CD26 | TP103
Type:
Enzyme
Mol. Mass.:
88271.01
Organism:
Homo sapiens (Human)
Description:
P27487
Residue:
766
  
Inhibitor
Name:
BDBM12463
Synonyms:
(1R,S)-(2E)-2-[2-(1-Adamantylamino)-1-fluoroethylidene]cyclopentanecarbonitrile 11.7b/2 | Fluoro-Olefin Analogue 45
Type:
Small organic molecule
Emp. Form.:
C18H25FN2
Mol. Mass.:
288.4029
SMILES:
F\C(CNC12CC3CC(CC(C3)C1)C2)=C1/CCCC1C#N
:
Substrate
Name:
BDBM11526
Synonyms:
1-(2-aminoacetyl)-N-(4-nitrophenyl)pyrrolidine-2-carboxamide Gly-Pro-pNA
Type:
Small organic molecule
Emp. Form.:
C13H16N4O4
Mol. Mass.:
292.2905
SMILES:
NCC(=O)N1CCCC1C(=O)Nc1ccc(cc1)[N+]([O-])=O
: