Target
Sortilin
Ligand
BDBM50445042
Substrate
Meas. Tech.
hSortilin Affinity Assay
Ki
162±n/a nM
Citation
 Maltas, PJWatson, SLanggård, MDavid, L N-substituted-5-substituted phthalamic acids as sortilin inhibitors US Patent  US10195186 Publication Date 2/5/2019 
Target
Name:
Sortilin
Synonyms:
Neurotensin receptor 3 SORT_HUMAN
Type:
PROTEIN
Mol. Mass.:
92054.53
Organism:
Homo sapiens (Human)
Description:
ChEMBL_1282402
Residue:
831
  
Inhibitor
Name:
BDBM50445042
Synonyms:
CHEMBL3098767 US9682967, 7
Type:
Small organic molecule
Emp. Form.:
C16H13F3N2O3
Mol. Mass.:
338.2812
SMILES:
Cc1ccc(NC(=O)c2ccc(cc2C(O)=O)C(F)(F)F)nc1C
: